Build failed in Jenkins: xmlgraphics-batik-maven #167

classic Classic list List threaded Threaded
3 messages Options
Reply | Threaded
Open this post in threaded view
|

Build failed in Jenkins: xmlgraphics-batik-maven #167

Apache Jenkins Server
See <https://builds.apache.org/job/xmlgraphics-batik-maven/167/display/redirect?page=changes>

Changes:

[ssteiner] Update year


------------------------------------------
[...truncated 807.01 KB...]
    [junit] .
    [junit] .
    [junit] .
    [junit] .
    [junit] .
    [junit] .
    [junit] .
    [junit] .
    [junit] .
    [junit] .
    [junit] .
    [junit] .
    [junit] .
    [junit] .
    [junit] .
    [junit] .
    [junit] .
    [junit] .
    [junit] .
    [junit] .
    [junit] .
    [junit] .
    [junit] .
    [junit] .
    [junit] .
    [junit] .
    [junit] .
    [junit]
    [junit] .
    [junit] .
    [junit] .
    [junit] .
    [junit] .
    [junit] .
    [junit] .
    [junit] .
    [junit] .
    [junit] .
    [junit] .
    [junit] .
    [junit] .
    [junit] .
    [junit] .
    [junit] .
    [junit] .
    [junit] .
    [junit] .
    [junit] .
    [junit] .
    [junit] .
    [junit] .
    [junit] .
    [junit] .
    [junit] .
    [junit] .
    [junit] .
    [junit] .
    [junit] .
    [junit] .
    [junit] .
    [junit] .
    [junit] .
    [junit] .
    [junit] .
    [junit] .
    [junit] .
    [junit] .
    [junit] .
    [junit] .
    [junit] .
    [junit] .
    [junit] .
    [junit] .
    [junit] .
    [junit] .
    [junit] .
    [junit] .
    [junit] .
    [junit]
    [junit] .
    [junit] .
    [junit] .
    [junit] .
    [junit] .
    [junit] .
    [junit] .
    [junit] .
    [junit] .
    [junit] .
    [junit] .
    [junit] .
    [junit] .
    [junit] .
    [junit] .
    [junit] .
    [junit] .
    [junit] .
    [junit] .
    [junit] .
    [junit] .
    [junit] .
    [junit] .
    [junit] .
    [junit] .
    [junit] .
    [junit] .
    [junit] .
    [junit] .
    [junit] .
    [junit] .
    [junit] .
    [junit] .
    [junit] .
    [junit] .
    [junit] .
    [junit] .
    [junit] .
    [junit] .
    [junit] .
    [junit] .
    [junit] .
    [junit] .
    [junit] .
    [junit] .
    [junit] .
    [junit] .
    [junit] .
    [junit] .
    [junit] .
    [junit]
    [junit] .
    [junit] .
    [junit] .
    [junit] .
    [junit] .
    [junit] .
    [junit] .
    [junit] .
    [junit] .
    [junit] .
    [junit] .
    [junit] .
    [junit] .
    [junit] .
    [junit] .
    [junit] .
    [junit] .
    [junit] .
    [junit] .
    [junit] .
    [junit] .
    [junit] .
    [junit] .
    [junit] .
    [junit] .
    [junit] .
    [junit] .
    [junit] .
    [junit] .
    [junit] .
    [junit] .
    [junit] .
    [junit] .
    [junit] .
    [junit] .
    [junit] .
    [junit] .
    [junit] .
    [junit] .
    [junit] .
    [junit] .
    [junit] .
    [junit] .
    [junit] .
    [junit] .
    [junit] .
    [junit] .
    [junit] .
    [junit] .
    [junit] .
    [junit]
    [junit] org.apache.batik.dom.util.SAXIOException: The prefix "xlink" for attribute "xlink:href" associated with an element type "use" is not bound.
    [junit] at org.apache.batik.dom.util.SAXDocumentFactory.createDocument(SAXDocumentFactory.java:459)
    [junit] at org.apache.batik.dom.util.SAXDocumentFactory.createDocument(SAXDocumentFactory.java:357)
    [junit] at org.apache.batik.anim.dom.SAXSVGDocumentFactory.createDocument(SAXSVGDocumentFactory.java:202)
    [junit] at org.apache.batik.test.svg.SVGOnLoadExceptionTest.testImpl(SVGOnLoadExceptionTest.java:410)
    [junit] at org.apache.batik.test.svg.SVGOnLoadExceptionTest.runImpl(SVGOnLoadExceptionTest.java:345)
    [junit] at org.apache.batik.test.AbstractTest.run(AbstractTest.java:182)
    [junit] at org.apache.batik.test.xml.JUnitRunnerTestCase.test(JUnitRunnerTestCase.java:122)
    [junit] at sun.reflect.GeneratedMethodAccessor4.invoke(Unknown Source)
    [junit] at sun.reflect.DelegatingMethodAccessorImpl.invoke(DelegatingMethodAccessorImpl.java:43)
    [junit] at java.lang.reflect.Method.invoke(Method.java:606)
    [junit] at org.junit.runners.model.FrameworkMethod$1.runReflectiveCall(FrameworkMethod.java:45)
    [junit] at org.junit.internal.runners.model.ReflectiveCallable.run(ReflectiveCallable.java:15)
    [junit] at org.junit.runners.model.FrameworkMethod.invokeExplosively(FrameworkMethod.java:42)
    [junit] at org.junit.internal.runners.statements.InvokeMethod.evaluate(InvokeMethod.java:20)
    [junit] at org.junit.runners.ParentRunner.runLeaf(ParentRunner.java:263)
    [junit] at org.junit.runners.BlockJUnit4ClassRunner.runChild(BlockJUnit4ClassRunner.java:68)
    [junit] at org.junit.runners.BlockJUnit4ClassRunner.runChild(BlockJUnit4ClassRunner.java:47)
    [junit] at org.junit.runners.ParentRunner$3.run(ParentRunner.java:231)
    [junit] at org.junit.runners.ParentRunner$1.schedule(ParentRunner.java:60)
    [junit] at org.junit.runners.ParentRunner.runChildren(ParentRunner.java:229)
    [junit] at org.junit.runners.ParentRunner.access$000(ParentRunner.java:50)
    [junit] at org.junit.runners.ParentRunner$2.evaluate(ParentRunner.java:222)
    [junit] at org.junit.runners.ParentRunner.run(ParentRunner.java:300)
    [junit] at org.junit.runners.Suite.runChild(Suite.java:128)
    [junit] at org.junit.runners.Suite.runChild(Suite.java:24)
    [junit] at org.junit.runners.ParentRunner$3.run(ParentRunner.java:231)
    [junit] at org.junit.runners.ParentRunner$1.schedule(ParentRunner.java:60)
    [junit] at org.junit.runners.ParentRunner.runChildren(ParentRunner.java:229)
    [junit] at org.junit.runners.ParentRunner.access$000(ParentRunner.java:50)
    [junit] at org.junit.runners.ParentRunner$2.evaluate(ParentRunner.java:222)
    [junit] at org.junit.internal.runners.statements.RunBefores.evaluate(RunBefores.java:28)
    [junit] at org.junit.runners.ParentRunner.run(ParentRunner.java:300)
    [junit] at junit.framework.JUnit4TestAdapter.run(JUnit4TestAdapter.java:39)
    [junit] at org.apache.tools.ant.taskdefs.optional.junit.JUnitTestRunner.run(JUnitTestRunner.java:536)
    [junit] at org.apache.tools.ant.taskdefs.optional.junit.JUnitTestRunner.launch(JUnitTestRunner.java:1178)
    [junit] at org.apache.tools.ant.taskdefs.optional.junit.JUnitTestRunner.main(JUnitTestRunner.java:1032)
    [junit] Caused by: org.xml.sax.SAXParseException; systemId: <https://builds.apache.org/job/xmlgraphics-batik-maven/ws/test-resources/org/apache/batik/bridge/error/xml-invalid.svg;> lineNumber: 38; columnNumber: 50; The prefix "xlink" for attribute "xlink:href" associated with an element type "use" is not bound.
    [junit] at org.apache.xerces.util.ErrorHandlerWrapper.createSAXParseException(Unknown Source)
    [junit] at org.apache.xerces.util.ErrorHandlerWrapper.fatalError(Unknown Source)
    [junit] at org.apache.xerces.impl.XMLErrorReporter.reportError(Unknown Source)
    [junit] at org.apache.xerces.impl.XMLErrorReporter.reportError(Unknown Source)
    [junit] at org.apache.xerces.impl.XMLErrorReporter.reportError(Unknown Source)
    [junit] at org.apache.xerces.impl.dtd.XMLNSDTDValidator.startNamespaceScope(Unknown Source)
    [junit] at org.apache.xerces.impl.dtd.XMLDTDValidator.handleStartElement(Unknown Source)
    [junit] at org.apache.xerces.impl.dtd.XMLDTDValidator.emptyElement(Unknown Source)
    [junit] at org.apache.xerces.impl.XMLNSDocumentScannerImpl.scanStartElement(Unknown Source)
    [junit] at org.apache.xerces.impl.XMLDocumentFragmentScannerImpl$FragmentContentDispatcher.dispatch(Unknown Source)
    [junit] at org.apache.xerces.impl.XMLDocumentFragmentScannerImpl.scanDocument(Unknown Source)
    [junit] at org.apache.xerces.parsers.XML11Configuration.parse(Unknown Source)
    [junit] at org.apache.xerces.parsers.XML11Configuration.parse(Unknown Source)
    [junit] at org.apache.xerces.parsers.XMLParser.parse(Unknown Source)
    [junit] at org.apache.xerces.parsers.AbstractSAXParser.parse(Unknown Source)
    [junit] at org.apache.xerces.jaxp.SAXParserImpl$JAXPSAXParser.parse(Unknown Source)
    [junit] at org.apache.batik.dom.util.SAXDocumentFactory.createDocument(SAXDocumentFactory.java:453)
    [junit] ... 35 more
    [junit] >>>>>>>>>>> Document content
    [junit]
    [junit] <svg contentScriptType="text/ecmascript" xmlns:xlink="http://www.w3.org/1999/xlink" zoomAndPan="magnify" contentStyleType="text/css" preserveAspectRatio="xMidYMid meet" xmlns="http://www.w3.org/2000/svg" version="1.0"><text id="myText"><![CDATA[You should not escape: & # " ...]]></text></svg>
    [junit]
    [junit] <<<<<<<<<<<<<<<<
    [junit] ------------- ---------------- ---------------

BUILD SUCCESSFUL
Total time: 1 minute 43 seconds
No JDK named ?JDK 1.8.0_144 (unlimited security)? found
No JDK named ?JDK 1.8.0_144 (unlimited security)? found
No JDK named ?JDK 1.8.0_144 (unlimited security)? found

---------------------------------------------------------------------
To unsubscribe, e-mail: [hidden email]
For additional commands, e-mail: [hidden email]

Reply | Threaded
Open this post in threaded view
|

Build failed in Jenkins: xmlgraphics-batik-maven #168

Apache Jenkins Server
See <https://builds.apache.org/job/xmlgraphics-batik-maven/168/display/redirect?page=changes>

Changes:

[ssteiner] Add changes


------------------------------------------
[...truncated 435.89 KB...]
    [junit] .
    [junit] .
    [junit] .
    [junit] .
    [junit] .
    [junit] .
    [junit] .
    [junit] .
    [junit] .
    [junit] .
    [junit] .
    [junit] .
    [junit] .
    [junit] .
    [junit] .
    [junit] .
    [junit] .
    [junit] .
    [junit] .
    [junit] .
    [junit] .
    [junit] .
    [junit] .
    [junit] .
    [junit] .
    [junit] .
    [junit] .
    [junit]
    [junit] .
    [junit] .
    [junit] .
    [junit] .
    [junit] .
    [junit] .
    [junit] .
    [junit] .
    [junit] .
    [junit] .
    [junit] .
    [junit] .
    [junit] .
    [junit] .
    [junit] .
    [junit] .
    [junit] .
    [junit] .
    [junit] .
    [junit] .
    [junit] .
    [junit] .
    [junit] .
    [junit] .
    [junit] .
    [junit] .
    [junit] .
    [junit] .
    [junit] .
    [junit] .
    [junit] .
    [junit] .
    [junit] .
    [junit] .
    [junit] .
    [junit] .
    [junit] .
    [junit] .
    [junit] .
    [junit] .
    [junit] .
    [junit] .
    [junit] .
    [junit] .
    [junit] .
    [junit] .
    [junit] .
    [junit] .
    [junit] .
    [junit] .
    [junit]
    [junit] .
    [junit] .
    [junit] .
    [junit] .
    [junit] .
    [junit] .
    [junit] .
    [junit] .
    [junit] .
    [junit] .
    [junit] .
    [junit] .
    [junit] .
    [junit] .
    [junit] .
    [junit] .
    [junit] .
    [junit] .
    [junit] .
    [junit] .
    [junit] .
    [junit] .
    [junit] .
    [junit] .
    [junit] .
    [junit] .
    [junit] .
    [junit] .
    [junit] .
    [junit] .
    [junit] .
    [junit] .
    [junit] .
    [junit] .
    [junit] .
    [junit] .
    [junit] .
    [junit] .
    [junit] .
    [junit] .
    [junit] .
    [junit] .
    [junit] .
    [junit] .
    [junit] .
    [junit] .
    [junit] .
    [junit] .
    [junit] .
    [junit] .
    [junit]
    [junit] .
    [junit] .
    [junit] .
    [junit] .
    [junit] .
    [junit] .
    [junit] .
    [junit] .
    [junit] .
    [junit] .
    [junit] .
    [junit] .
    [junit] .
    [junit] .
    [junit] .
    [junit] .
    [junit] .
    [junit] .
    [junit] .
    [junit] .
    [junit] .
    [junit] .
    [junit] .
    [junit] .
    [junit] .
    [junit] .
    [junit] .
    [junit] .
    [junit] .
    [junit] .
    [junit] .
    [junit] .
    [junit] .
    [junit] .
    [junit] .
    [junit] .
    [junit] .
    [junit] .
    [junit] .
    [junit] .
    [junit] .
    [junit] .
    [junit] .
    [junit] .
    [junit] .
    [junit] .
    [junit] .
    [junit] .
    [junit] .
    [junit] .
    [junit]
    [junit] org.apache.batik.dom.util.SAXIOException: The prefix "xlink" for attribute "xlink:href" associated with an element type "use" is not bound.
    [junit] at org.apache.batik.dom.util.SAXDocumentFactory.createDocument(SAXDocumentFactory.java:459)
    [junit] at org.apache.batik.dom.util.SAXDocumentFactory.createDocument(SAXDocumentFactory.java:357)
    [junit] at org.apache.batik.anim.dom.SAXSVGDocumentFactory.createDocument(SAXSVGDocumentFactory.java:202)
    [junit] at org.apache.batik.test.svg.SVGOnLoadExceptionTest.testImpl(SVGOnLoadExceptionTest.java:410)
    [junit] at org.apache.batik.test.svg.SVGOnLoadExceptionTest.runImpl(SVGOnLoadExceptionTest.java:345)
    [junit] at org.apache.batik.test.AbstractTest.run(AbstractTest.java:182)
    [junit] at org.apache.batik.test.xml.JUnitRunnerTestCase.test(JUnitRunnerTestCase.java:122)
    [junit] at sun.reflect.GeneratedMethodAccessor4.invoke(Unknown Source)
    [junit] at sun.reflect.DelegatingMethodAccessorImpl.invoke(DelegatingMethodAccessorImpl.java:43)
    [junit] at java.lang.reflect.Method.invoke(Method.java:606)
    [junit] at org.junit.runners.model.FrameworkMethod$1.runReflectiveCall(FrameworkMethod.java:45)
    [junit] at org.junit.internal.runners.model.ReflectiveCallable.run(ReflectiveCallable.java:15)
    [junit] at org.junit.runners.model.FrameworkMethod.invokeExplosively(FrameworkMethod.java:42)
    [junit] at org.junit.internal.runners.statements.InvokeMethod.evaluate(InvokeMethod.java:20)
    [junit] at org.junit.runners.ParentRunner.runLeaf(ParentRunner.java:263)
    [junit] at org.junit.runners.BlockJUnit4ClassRunner.runChild(BlockJUnit4ClassRunner.java:68)
    [junit] at org.junit.runners.BlockJUnit4ClassRunner.runChild(BlockJUnit4ClassRunner.java:47)
    [junit] at org.junit.runners.ParentRunner$3.run(ParentRunner.java:231)
    [junit] at org.junit.runners.ParentRunner$1.schedule(ParentRunner.java:60)
    [junit] at org.junit.runners.ParentRunner.runChildren(ParentRunner.java:229)
    [junit] at org.junit.runners.ParentRunner.access$000(ParentRunner.java:50)
    [junit] at org.junit.runners.ParentRunner$2.evaluate(ParentRunner.java:222)
    [junit] at org.junit.runners.ParentRunner.run(ParentRunner.java:300)
    [junit] at org.junit.runners.Suite.runChild(Suite.java:128)
    [junit] at org.junit.runners.Suite.runChild(Suite.java:24)
    [junit] at org.junit.runners.ParentRunner$3.run(ParentRunner.java:231)
    [junit] at org.junit.runners.ParentRunner$1.schedule(ParentRunner.java:60)
    [junit] at org.junit.runners.ParentRunner.runChildren(ParentRunner.java:229)
    [junit] at org.junit.runners.ParentRunner.access$000(ParentRunner.java:50)
    [junit] at org.junit.runners.ParentRunner$2.evaluate(ParentRunner.java:222)
    [junit] at org.junit.internal.runners.statements.RunBefores.evaluate(RunBefores.java:28)
    [junit] at org.junit.runners.ParentRunner.run(ParentRunner.java:300)
    [junit] at junit.framework.JUnit4TestAdapter.run(JUnit4TestAdapter.java:39)
    [junit] at org.apache.tools.ant.taskdefs.optional.junit.JUnitTestRunner.run(JUnitTestRunner.java:536)
    [junit] at org.apache.tools.ant.taskdefs.optional.junit.JUnitTestRunner.launch(JUnitTestRunner.java:1178)
    [junit] at org.apache.tools.ant.taskdefs.optional.junit.JUnitTestRunner.main(JUnitTestRunner.java:1032)
    [junit] Caused by: org.xml.sax.SAXParseException; systemId: <https://builds.apache.org/job/xmlgraphics-batik-maven/ws/test-resources/org/apache/batik/bridge/error/xml-invalid.svg;> lineNumber: 38; columnNumber: 50; The prefix "xlink" for attribute "xlink:href" associated with an element type "use" is not bound.
    [junit] at org.apache.xerces.util.ErrorHandlerWrapper.createSAXParseException(Unknown Source)
    [junit] at org.apache.xerces.util.ErrorHandlerWrapper.fatalError(Unknown Source)
    [junit] at org.apache.xerces.impl.XMLErrorReporter.reportError(Unknown Source)
    [junit] at org.apache.xerces.impl.XMLErrorReporter.reportError(Unknown Source)
    [junit] at org.apache.xerces.impl.XMLErrorReporter.reportError(Unknown Source)
    [junit] at org.apache.xerces.impl.dtd.XMLNSDTDValidator.startNamespaceScope(Unknown Source)
    [junit] at org.apache.xerces.impl.dtd.XMLDTDValidator.handleStartElement(Unknown Source)
    [junit] at org.apache.xerces.impl.dtd.XMLDTDValidator.emptyElement(Unknown Source)
    [junit] at org.apache.xerces.impl.XMLNSDocumentScannerImpl.scanStartElement(Unknown Source)
    [junit] at org.apache.xerces.impl.XMLDocumentFragmentScannerImpl$FragmentContentDispatcher.dispatch(Unknown Source)
    [junit] at org.apache.xerces.impl.XMLDocumentFragmentScannerImpl.scanDocument(Unknown Source)
    [junit] at org.apache.xerces.parsers.XML11Configuration.parse(Unknown Source)
    [junit] at org.apache.xerces.parsers.XML11Configuration.parse(Unknown Source)
    [junit] at org.apache.xerces.parsers.XMLParser.parse(Unknown Source)
    [junit] at org.apache.xerces.parsers.AbstractSAXParser.parse(Unknown Source)
    [junit] at org.apache.xerces.jaxp.SAXParserImpl$JAXPSAXParser.parse(Unknown Source)
    [junit] at org.apache.batik.dom.util.SAXDocumentFactory.createDocument(SAXDocumentFactory.java:453)
    [junit] ... 35 more
    [junit] >>>>>>>>>>> Document content
    [junit]
    [junit] <svg contentScriptType="text/ecmascript" xmlns:xlink="http://www.w3.org/1999/xlink" zoomAndPan="magnify" contentStyleType="text/css" preserveAspectRatio="xMidYMid meet" xmlns="http://www.w3.org/2000/svg" version="1.0"><text id="myText"><![CDATA[You should not escape: & # " ...]]></text></svg>
    [junit]
    [junit] <<<<<<<<<<<<<<<<
    [junit] ------------- ---------------- ---------------

BUILD SUCCESSFUL
Total time: 1 minute 58 seconds
No JDK named ?JDK 1.8.0_144 (unlimited security)? found
No JDK named ?JDK 1.8.0_144 (unlimited security)? found
No JDK named ?JDK 1.8.0_144 (unlimited security)? found

---------------------------------------------------------------------
To unsubscribe, e-mail: [hidden email]
For additional commands, e-mail: [hidden email]

Reply | Threaded
Open this post in threaded view
|

Build failed in Jenkins: xmlgraphics-batik-maven #169

Apache Jenkins Server
See <https://builds.apache.org/job/xmlgraphics-batik-maven/169/display/redirect?page=changes>

Changes:

[ssteiner] Add back resource filtering


------------------------------------------
[...truncated 742.13 KB...]
    [junit] .
    [junit] .
    [junit] .
    [junit] .
    [junit] .
    [junit] .
    [junit] .
    [junit] .
    [junit] .
    [junit] .
    [junit] .
    [junit] .
    [junit] .
    [junit] .
    [junit] .
    [junit] .
    [junit] .
    [junit] .
    [junit] .
    [junit] .
    [junit] .
    [junit] .
    [junit] .
    [junit] .
    [junit] .
    [junit] .
    [junit] .
    [junit]
    [junit] .
    [junit] .
    [junit] .
    [junit] .
    [junit] .
    [junit] .
    [junit] .
    [junit] .
    [junit] .
    [junit] .
    [junit] .
    [junit] .
    [junit] .
    [junit] .
    [junit] .
    [junit] .
    [junit] .
    [junit] .
    [junit] .
    [junit] .
    [junit] .
    [junit] .
    [junit] .
    [junit] .
    [junit] .
    [junit] .
    [junit] .
    [junit] .
    [junit] .
    [junit] .
    [junit] .
    [junit] .
    [junit] .
    [junit] .
    [junit] .
    [junit] .
    [junit] .
    [junit] .
    [junit] .
    [junit] .
    [junit] .
    [junit] .
    [junit] .
    [junit] .
    [junit] .
    [junit] .
    [junit] .
    [junit] .
    [junit] .
    [junit] .
    [junit]
    [junit] .
    [junit] .
    [junit] .
    [junit] .
    [junit] .
    [junit] .
    [junit] .
    [junit] .
    [junit] .
    [junit] .
    [junit] .
    [junit] .
    [junit] .
    [junit] .
    [junit] .
    [junit] .
    [junit] .
    [junit] .
    [junit] .
    [junit] .
    [junit] .
    [junit] .
    [junit] .
    [junit] .
    [junit] .
    [junit] .
    [junit] .
    [junit] .
    [junit] .
    [junit] .
    [junit] .
    [junit] .
    [junit] .
    [junit] .
    [junit] .
    [junit] .
    [junit] .
    [junit] .
    [junit] .
    [junit] .
    [junit] .
    [junit] .
    [junit] .
    [junit] .
    [junit] .
    [junit] .
    [junit] .
    [junit] .
    [junit] .
    [junit] .
    [junit]
    [junit] .
    [junit] .
    [junit] .
    [junit] .
    [junit] .
    [junit] .
    [junit] .
    [junit] .
    [junit] .
    [junit] .
    [junit] .
    [junit] .
    [junit] .
    [junit] .
    [junit] .
    [junit] .
    [junit] .
    [junit] .
    [junit] .
    [junit] .
    [junit] .
    [junit] .
    [junit] .
    [junit] .
    [junit] .
    [junit] .
    [junit] .
    [junit] .
    [junit] .
    [junit] .
    [junit] .
    [junit] .
    [junit] .
    [junit] .
    [junit] .
    [junit] .
    [junit] .
    [junit] .
    [junit] .
    [junit] .
    [junit] .
    [junit] .
    [junit] .
    [junit] .
    [junit] .
    [junit] .
    [junit] .
    [junit] .
    [junit] .
    [junit] .
    [junit]
    [junit] org.apache.batik.dom.util.SAXIOException: The prefix "xlink" for attribute "xlink:href" associated with an element type "use" is not bound.
    [junit] at org.apache.batik.dom.util.SAXDocumentFactory.createDocument(SAXDocumentFactory.java:459)
    [junit] at org.apache.batik.dom.util.SAXDocumentFactory.createDocument(SAXDocumentFactory.java:357)
    [junit] at org.apache.batik.anim.dom.SAXSVGDocumentFactory.createDocument(SAXSVGDocumentFactory.java:202)
    [junit] at org.apache.batik.test.svg.SVGOnLoadExceptionTest.testImpl(SVGOnLoadExceptionTest.java:410)
    [junit] at org.apache.batik.test.svg.SVGOnLoadExceptionTest.runImpl(SVGOnLoadExceptionTest.java:345)
    [junit] at org.apache.batik.test.AbstractTest.run(AbstractTest.java:182)
    [junit] at org.apache.batik.test.xml.JUnitRunnerTestCase.test(JUnitRunnerTestCase.java:122)
    [junit] at sun.reflect.GeneratedMethodAccessor4.invoke(Unknown Source)
    [junit] at sun.reflect.DelegatingMethodAccessorImpl.invoke(DelegatingMethodAccessorImpl.java:43)
    [junit] at java.lang.reflect.Method.invoke(Method.java:606)
    [junit] at org.junit.runners.model.FrameworkMethod$1.runReflectiveCall(FrameworkMethod.java:45)
    [junit] at org.junit.internal.runners.model.ReflectiveCallable.run(ReflectiveCallable.java:15)
    [junit] at org.junit.runners.model.FrameworkMethod.invokeExplosively(FrameworkMethod.java:42)
    [junit] at org.junit.internal.runners.statements.InvokeMethod.evaluate(InvokeMethod.java:20)
    [junit] at org.junit.runners.ParentRunner.runLeaf(ParentRunner.java:263)
    [junit] at org.junit.runners.BlockJUnit4ClassRunner.runChild(BlockJUnit4ClassRunner.java:68)
    [junit] at org.junit.runners.BlockJUnit4ClassRunner.runChild(BlockJUnit4ClassRunner.java:47)
    [junit] at org.junit.runners.ParentRunner$3.run(ParentRunner.java:231)
    [junit] at org.junit.runners.ParentRunner$1.schedule(ParentRunner.java:60)
    [junit] at org.junit.runners.ParentRunner.runChildren(ParentRunner.java:229)
    [junit] at org.junit.runners.ParentRunner.access$000(ParentRunner.java:50)
    [junit] at org.junit.runners.ParentRunner$2.evaluate(ParentRunner.java:222)
    [junit] at org.junit.runners.ParentRunner.run(ParentRunner.java:300)
    [junit] at org.junit.runners.Suite.runChild(Suite.java:128)
    [junit] at org.junit.runners.Suite.runChild(Suite.java:24)
    [junit] at org.junit.runners.ParentRunner$3.run(ParentRunner.java:231)
    [junit] at org.junit.runners.ParentRunner$1.schedule(ParentRunner.java:60)
    [junit] at org.junit.runners.ParentRunner.runChildren(ParentRunner.java:229)
    [junit] at org.junit.runners.ParentRunner.access$000(ParentRunner.java:50)
    [junit] at org.junit.runners.ParentRunner$2.evaluate(ParentRunner.java:222)
    [junit] at org.junit.internal.runners.statements.RunBefores.evaluate(RunBefores.java:28)
    [junit] at org.junit.runners.ParentRunner.run(ParentRunner.java:300)
    [junit] at junit.framework.JUnit4TestAdapter.run(JUnit4TestAdapter.java:39)
    [junit] at org.apache.tools.ant.taskdefs.optional.junit.JUnitTestRunner.run(JUnitTestRunner.java:536)
    [junit] at org.apache.tools.ant.taskdefs.optional.junit.JUnitTestRunner.launch(JUnitTestRunner.java:1178)
    [junit] at org.apache.tools.ant.taskdefs.optional.junit.JUnitTestRunner.main(JUnitTestRunner.java:1032)
    [junit] Caused by: org.xml.sax.SAXParseException; systemId: <https://builds.apache.org/job/xmlgraphics-batik-maven/ws/test-resources/org/apache/batik/bridge/error/xml-invalid.svg;> lineNumber: 38; columnNumber: 50; The prefix "xlink" for attribute "xlink:href" associated with an element type "use" is not bound.
    [junit] at org.apache.xerces.util.ErrorHandlerWrapper.createSAXParseException(Unknown Source)
    [junit] at org.apache.xerces.util.ErrorHandlerWrapper.fatalError(Unknown Source)
    [junit] at org.apache.xerces.impl.XMLErrorReporter.reportError(Unknown Source)
    [junit] at org.apache.xerces.impl.XMLErrorReporter.reportError(Unknown Source)
    [junit] at org.apache.xerces.impl.XMLErrorReporter.reportError(Unknown Source)
    [junit] at org.apache.xerces.impl.dtd.XMLNSDTDValidator.startNamespaceScope(Unknown Source)
    [junit] at org.apache.xerces.impl.dtd.XMLDTDValidator.handleStartElement(Unknown Source)
    [junit] at org.apache.xerces.impl.dtd.XMLDTDValidator.emptyElement(Unknown Source)
    [junit] at org.apache.xerces.impl.XMLNSDocumentScannerImpl.scanStartElement(Unknown Source)
    [junit] at org.apache.xerces.impl.XMLDocumentFragmentScannerImpl$FragmentContentDispatcher.dispatch(Unknown Source)
    [junit] at org.apache.xerces.impl.XMLDocumentFragmentScannerImpl.scanDocument(Unknown Source)
    [junit] at org.apache.xerces.parsers.XML11Configuration.parse(Unknown Source)
    [junit] at org.apache.xerces.parsers.XML11Configuration.parse(Unknown Source)
    [junit] at org.apache.xerces.parsers.XMLParser.parse(Unknown Source)
    [junit] at org.apache.xerces.parsers.AbstractSAXParser.parse(Unknown Source)
    [junit] at org.apache.xerces.jaxp.SAXParserImpl$JAXPSAXParser.parse(Unknown Source)
    [junit] at org.apache.batik.dom.util.SAXDocumentFactory.createDocument(SAXDocumentFactory.java:453)
    [junit] ... 35 more
    [junit] >>>>>>>>>>> Document content
    [junit]
    [junit] <svg contentScriptType="text/ecmascript" xmlns:xlink="http://www.w3.org/1999/xlink" zoomAndPan="magnify" contentStyleType="text/css" preserveAspectRatio="xMidYMid meet" xmlns="http://www.w3.org/2000/svg" version="1.0"><text id="myText"><![CDATA[You should not escape: & # " ...]]></text></svg>
    [junit]
    [junit] <<<<<<<<<<<<<<<<
    [junit] ------------- ---------------- ---------------

BUILD SUCCESSFUL
Total time: 1 minute 37 seconds
No JDK named ?JDK 1.8.0_144 (unlimited security)? found
No JDK named ?JDK 1.8.0_144 (unlimited security)? found
No JDK named ?JDK 1.8.0_144 (unlimited security)? found

---------------------------------------------------------------------
To unsubscribe, e-mail: [hidden email]
For additional commands, e-mail: [hidden email]